ВИДЕНИЕ (ОБРАЗ)
type: LexicalConcept
holonym: http://lod.ruthes.org/resource/concept/117099
hypernym: http://lod.ruthes.org/resource/concept/107543
hyponym: http://lod.ruthes.org/resource/concept/129448
hyponym: http://lod.ruthes.org/resource/concept/135602
definition: то, что привиделось; фантастический образ, возникающий в воображении
in scheme: ruthes
lexicalized sense: 129447-видение-n-0
lexicalized sense: 129447-виденье-n-0