ЧАСТОТА В ЕДИНИЦУ ВРЕМЕНИ
type: LexicalConcept
association2: http://lod.ruthes.org/resource/concept/141052
hypernym: http://lod.ruthes.org/resource/concept/106515
hypernym: http://lod.ruthes.org/resource/concept/110871
hyponym: http://lod.ruthes.org/resource/concept/135651
hyponym: http://lod.ruthes.org/resource/concept/6805
hyponym: http://lod.ruthes.org/resource/concept/9536
definition: величина, выражающая количество одинаковых движений, колебаний и т. п. в единицу времени
in scheme: ruthes
lexicalized sense: 129518-частота-n-0
lexicalized sense: 129518-частота в единицу времени-ng-0
lexicalized sense: 129518-частотный-adj-0