ЧУДОТВОРЕЦ
type: LexicalConcept
holonym: http://lod.ruthes.org/resource/concept/152945
hypernym: http://lod.ruthes.org/resource/concept/129543
hypernym: http://lod.ruthes.org/resource/concept/2149
definition: в религиозных представлениях — святой, обладающий даром совершать, творить чудеса
in scheme: ruthes
lexicalized sense: 129541-чудотворец-n-0