СВЯТОЙ ПРАВЕДНИК
type: LexicalConcept
association2: http://lod.ruthes.org/resource/concept/126158
association2: http://lod.ruthes.org/resource/concept/132960
association2: http://lod.ruthes.org/resource/concept/136052
hypernym: http://lod.ruthes.org/resource/concept/125552
hyponym: http://lod.ruthes.org/resource/concept/129541
hyponym: http://lod.ruthes.org/resource/concept/143215
hyponym: http://lod.ruthes.org/resource/concept/145814
definition: праведник, официально признаваемый и чтимый церковью
in scheme: ruthes
lexicalized sense: 129543-преподобный-adj-0
lexicalized sense: 129543-святитель-n-0
lexicalized sense: 129543-святой-adj-0
lexicalized sense: 129543-святой праведник-ng-0