ЭКСКУРС (ИЗУЧЕНИЕ, ОСВЕЩЕНИЕ СПЕЦ. ВОПРОСА)
type: LexicalConcept
hypernym: http://lod.ruthes.org/resource/concept/106686
hypernym: http://lod.ruthes.org/resource/concept/106895
hypernym: http://lod.ruthes.org/resource/concept/137122
definition: отступление от главной темы изложения для освещения побочного или дополнительного вопроса
in scheme: ruthes
lexicalized sense: 129586-экскурс-n-0