ЭСМИНЕЦ
type: LexicalConcept
hypernym: http://lod.ruthes.org/resource/concept/126985
hypernym: http://lod.ruthes.org/resource/concept/6615
hypernym: http://lod.ruthes.org/resource/concept/7832
definition: эскадренный миноносец; многоцелевой боевой быстроходный маневренный корабль для борьбы с подводными лодками, летательными аппаратами и кораблями противника, а также для охраны и обороны соединений кораблей или конвоев
in scheme: ruthes
lexicalized sense: 129671-большой противолодочный корабль-ng-0
lexicalized sense: 129671-эскадренный миноносец-ng-0
lexicalized sense: 129671-эсминец-n-0