ВУЛЬГАРНЫЙ (УПРОЩЕННЫЙ ДО ИСКАЖЕНИЯ, ОПОШЛЕНИЯ)
type: LexicalConcept
hypernym: http://lod.ruthes.org/resource/concept/130302
definition: вульгарный поступок, высказывание и т. п.
in scheme: ruthes
lexicalized sense: 130301-вульгарность-n-0
lexicalized sense: 130301-вульгарный-adj-0