ИСПАНСКИЙ ГРАНД
type: LexicalConcept
hypernym: http://lod.ruthes.org/resource/concept/105383
hypernym: http://lod.ruthes.org/resource/concept/110604
hypernym: http://lod.ruthes.org/resource/concept/110641
definition: в средневековой Испании наследственный титул высших испанских дворян, принадлежащих к высшей придворной знати, дающий право стоять перед королем с покрытой головой
in scheme: ruthes
lexicalized sense: 130673-гранд-n-0
lexicalized sense: 130673-испанский гранд-ng-0