ДЕРЗАТЬ (СМЕЛО СТРЕМИТЬСЯ К ЧЕМУ-Н. НОВОМУ, БЛАГОРОДНОМУ)
type: LexicalConcept
hypernym: http://lod.ruthes.org/resource/concept/106476
meronym: http://lod.ruthes.org/resource/concept/119357
definition: смелое стремление к чему-либо (обычно высокому, благородному, новому и т. п)
in scheme: ruthes
lexicalized sense: 130815-дерзание-n-0
lexicalized sense: 130815-дерзать-v-0
lexicalized sense: 130815-дерзновение-n-0
lexicalized sense: 130815-дерзнуть-v-0