ДОБРОДЕТЕЛЬ (ПОЛОЖИТЕЛЬНОЕ НРАВСТВЕННОЕ КАЧЕСТВО)
type: LexicalConcept
association: http://lod.ruthes.org/resource/concept/119264
hypernym: http://lod.ruthes.org/resource/concept/106924
hypernym: http://lod.ruthes.org/resource/concept/113276
definition: положительное нравственное качество человека, свойство характера, одобряемое с моральной точки зрения
in scheme: ruthes
lexicalized sense: 130870-добродетель-n-0