ЗАСУДИТЬ (ОБВИНИТЬ ПО СУДУ)
type: LexicalConcept
association1: http://lod.ruthes.org/resource/concept/7750
hypernym: http://lod.ruthes.org/resource/concept/144155
hypernym: http://lod.ruthes.org/resource/concept/3496
definition: обвинив кого-либо по суду, приговорить к какому-либо сроку наказания, с помощью судебного преследования добиться наказания кого-либо
in scheme: ruthes
lexicalized sense: 131598-засудить-v-0
lexicalized sense: 131598-засуживание-n-0
lexicalized sense: 131598-засуживать-v-0