КОРЕНАСТЫЙ, ПРИЗЕМИСТЫЙ
type: LexicalConcept
hypernym: http://lod.ruthes.org/resource/concept/131975
hypernym: http://lod.ruthes.org/resource/concept/131976
definition: малорослый, но плотного и крепкого телосложения
in scheme: ruthes
lexicalized sense: 131977-коренастость-n-0
lexicalized sense: 131977-коренастый-adj-0
lexicalized sense: 131977-плотный-adj-0
lexicalized sense: 131977-приземистость-n-0
lexicalized sense: 131977-приземистый-adj-0