КУРС ОБУЧЕНИЯ
type: LexicalConcept
association1: http://lod.ruthes.org/resource/concept/3989
association2: http://lod.ruthes.org/resource/concept/149653
holonym: http://lod.ruthes.org/resource/concept/1604
hypernym: http://lod.ruthes.org/resource/concept/122084
hyponym: http://lod.ruthes.org/resource/concept/129848
hyponym: http://lod.ruthes.org/resource/concept/142371
hyponym: http://lod.ruthes.org/resource/concept/149927
meronym: http://lod.ruthes.org/resource/concept/3793
definition: отдельная годичная ступень обучения в высшей школе и некоторых специальных учебных заведениях
in scheme: ruthes
lexicalized sense: 132103-академический курс-ng-0
lexicalized sense: 132103-курс-n-0
lexicalized sense: 132103-курс занятий-ng-0
lexicalized sense: 132103-курс обучения-ng-0
lexicalized sense: 132103-учебный курс-ng-0