ПОМЯТЫЙ (УТОМЛЕННЫЙ)
type: LexicalConcept
hypernym: http://lod.ruthes.org/resource/concept/107336
hypernym: http://lod.ruthes.org/resource/concept/151360
definition: усталый, болезненный от распущенной, беспорядочной жизни
in scheme: ruthes
lexicalized sense: 132727-мятость-n-0
lexicalized sense: 132727-мятый-adj-0
lexicalized sense: 132727-помятость-n-0
lexicalized sense: 132727-помятый-adj-0
lexicalized sense: 132727-поношенность-n-0
lexicalized sense: 132727-поношенный-adj-0
lexicalized sense: 132727-потасканность-n-0
lexicalized sense: 132727-потасканный-adj-0
lexicalized sense: 132727-потертый-adj-0
lexicalized sense: 132727-потрепанность-n-0
lexicalized sense: 132727-потрепанный-adj-0