ВЗРОСЛАЯ ЖЕНЩИНА
type: LexicalConcept
association1: http://lod.ruthes.org/resource/concept/125609
association2: http://lod.ruthes.org/resource/concept/126701
association2: http://lod.ruthes.org/resource/concept/151158
hypernym: http://lod.ruthes.org/resource/concept/2553
hypernym: http://lod.ruthes.org/resource/concept/756
hyponym: http://lod.ruthes.org/resource/concept/117644
hyponym: http://lod.ruthes.org/resource/concept/120430
hyponym: http://lod.ruthes.org/resource/concept/125917
hyponym: http://lod.ruthes.org/resource/concept/129729
hyponym: http://lod.ruthes.org/resource/concept/131980
hyponym: http://lod.ruthes.org/resource/concept/132892
hyponym: http://lod.ruthes.org/resource/concept/3817
hyponym: http://lod.ruthes.org/resource/concept/6738
hyponym: http://lod.ruthes.org/resource/concept/757
hyponym: http://lod.ruthes.org/resource/concept/759
definition: взрослый человек женского пола; лицо, противоположное мужчине по полу; самка человека
in scheme: ruthes
lexicalized sense: 132890-бальзаковский возраст-ng-0
lexicalized sense: 132890-взрослая женщина-ng-0
lexicalized sense: 132890-дама-n-0
lexicalized sense: 132890-дамский-adj-0
lexicalized sense: 132890-женский-adj-0
lexicalized sense: 132890-женщина-n-0
lexicalized sense: 132890-зрелая женщина-ng-0
lexicalized sense: 132890-тетка-n-0
lexicalized sense: 132890-тетя-n-0