НЕПРИХОТЛИВЫЙ, НЕПРИТЯЗАТЕЛЬНЫЙ
type: LexicalConcept
hypernym: http://lod.ruthes.org/resource/concept/118914
hypernym: http://lod.ruthes.org/resource/concept/132915
definition: способный или готовый довольствоваться самым малым, необходимым; нетребовательный
in scheme: ruthes
lexicalized sense: 132937-непритязательность-n-0
lexicalized sense: 132937-непритязательный-adj-0
lexicalized sense: 132937-неприхотливость-n-0
lexicalized sense: 132937-неприхотливый-adj-0
lexicalized sense: 132937-скромность-n-0
lexicalized sense: 132937-скромный-adj-0