ПАРИ (УСЛОВИЕ)
type: LexicalConcept
holonym: http://lod.ruthes.org/resource/concept/133584
hypernym: http://lod.ruthes.org/resource/concept/106448
definition: соглашение между спорящими лицами о выполнении какого-либо обязательства проигравшим спор
in scheme: ruthes
lexicalized sense: 133585-пари-n-0