ШКОЛЬНАЯ ПЕРЕМЕНА
type: LexicalConcept
association1: http://lod.ruthes.org/resource/concept/123780
holonym: http://lod.ruthes.org/resource/concept/1615
hypernym: http://lod.ruthes.org/resource/concept/112725
definition: перерыв между занятиями в учебном заведении (например, в школе)
in scheme: ruthes
lexicalized sense: 133658-перемена-n-0
lexicalized sense: 133658-переменка-n-0
lexicalized sense: 133658-школьная перемена-ng-0