ЧАСТНЫЙ, ПРИВАТНЫЙ
type: LexicalConcept
hypernym: http://lod.ruthes.org/resource/concept/119215
definition: касающийся отдельного лица (отдельных лиц); личный
in scheme: ruthes
lexicalized sense: 134082-в приватном порядке-ng-0
lexicalized sense: 134082-приватность-n-0
lexicalized sense: 134082-приватный-adj-0
lexicalized sense: 134082-частный-adj-0