НАЛЕТ, ОТТЕНОК
type: LexicalConcept
hypernym: http://lod.ruthes.org/resource/concept/106768
hypernym: http://lod.ruthes.org/resource/concept/130864
definition: дополнительное свойство, слабый след чего-либо
in scheme: ruthes
lexicalized sense: 134087-налет-n-0
lexicalized sense: 134087-оттенок-n-0
lexicalized sense: 134087-привкус-n-0