ПЕРВЕНСТВО (ПЕРВОЕ МЕСТО ПО ЗАСЛУГАМ, КАЧЕСТВАМ)
type: LexicalConcept
holonym: http://lod.ruthes.org/resource/concept/137950
hypernym: http://lod.ruthes.org/resource/concept/106510
hyponym: http://lod.ruthes.org/resource/concept/134107
definition: превосходство в чём-либо (по значению, заслугам, качествам)
in scheme: ruthes
lexicalized sense: 134106-пальма первенства-ng-0
lexicalized sense: 134106-первенство-n-0