СРЕДНЕЕ АРИФМЕТИЧЕСКОЕ
type: LexicalConcept
hypernym: http://lod.ruthes.org/resource/concept/106515
hypernym: http://lod.ruthes.org/resource/concept/142465
hyponym: http://lod.ruthes.org/resource/concept/148323
hyponym: http://lod.ruthes.org/resource/concept/148324
definition: полученный в результате сложения частей и последующего деления на количество этих частей
in scheme: ruthes
lexicalized sense: 134248-среднеарифметическая величина-ng-0
lexicalized sense: 134248-среднеарифметический-adj-0
lexicalized sense: 134248-среднеарифметическое значение-ng-0
lexicalized sense: 134248-среднее арифметическое-adjg-0