ИНОСТРАННЫЙ РАБОЧИЙ
type: LexicalConcept
holonym: http://lod.ruthes.org/resource/concept/136703
hypernym: http://lod.ruthes.org/resource/concept/3789
hypernym: http://lod.ruthes.org/resource/concept/6535
definition: наёмный рабочий, работающий и постоянно проживающий в стране, гражданином которой не является
in scheme: ruthes
lexicalized sense: 134713-гастарбайтер-n-0
lexicalized sense: 134713-иностранная рабочая сила-ng-0
lexicalized sense: 134713-иностранный работник-ng-0
lexicalized sense: 134713-иностранный рабочий-adjg-0
lexicalized sense: 134713-иностранный сотрудник-ng-0
lexicalized sense: 134713-иностранный трудящийся-adjg-0