ГЛАГОЛ-СВЯЗКА
type: LexicalConcept
hypernym: http://lod.ruthes.org/resource/concept/110594
definition: служебное слово, соединяющее подлежащее со сказуемым.
in scheme: ruthes
lexicalized sense: 134792-глагольная связка-ng-0
lexicalized sense: 134792-связка-n-0