СЕМИТЫ
type: LexicalConcept
hypernym: http://lod.ruthes.org/resource/concept/106131
hyponym: http://lod.ruthes.org/resource/concept/105335
hyponym: http://lod.ruthes.org/resource/concept/105413
definition: группа близких по языку народов, населяющих или населявших Северную и Восточную Африку и Юго-Западную Азию (к которой относятся древние вавилоняне, ассирийцы, финикийцы, иудеи итп, а также современные арабы, сирийцы, евреи, эфиопы)
in scheme: ruthes
lexicalized sense: 134850-семитический-adj-0
lexicalized sense: 134850-семитка-n-0
lexicalized sense: 134850-семитский-adj-0
lexicalized sense: 134850-семиты-n-0