СКАУТ
type: LexicalConcept
holonym: http://lod.ruthes.org/resource/concept/143093
hypernym: http://lod.ruthes.org/resource/concept/613
definition: член детской или юношеской организации, возникшей в Англии в конце XIX — начале XX вв. в качестве основной формы внешкольного воспитания детей и подростков
in scheme: ruthes
lexicalized sense: 134862-скаут-n-0
lexicalized sense: 134862-скаутский-adj-0