ШТАБ (РУКОВОДЯЩИЙ ОРГАН)
type: LexicalConcept
hypernym: http://lod.ruthes.org/resource/concept/117041
hypernym: http://lod.ruthes.org/resource/concept/120679
hyponym: http://lod.ruthes.org/resource/concept/6308
definition: центральный, руководящий орган чего-либо
in scheme: ruthes
lexicalized sense: 134877-руководящий штаб-ng-0
lexicalized sense: 134877-штаб-n-0