СИЛА, ЖИЗНЕННАЯ СИЛА
type: LexicalConcept
association2: http://lod.ruthes.org/resource/concept/116934
association2: http://lod.ruthes.org/resource/concept/117324
association2: http://lod.ruthes.org/resource/concept/132994
hypernym: http://lod.ruthes.org/resource/concept/106766
hyponym: http://lod.ruthes.org/resource/concept/133555
hyponym: http://lod.ruthes.org/resource/concept/135447
hyponym: http://lod.ruthes.org/resource/concept/139171
hyponym: http://lod.ruthes.org/resource/concept/139796
hyponym: http://lod.ruthes.org/resource/concept/142810
hyponym: http://lod.ruthes.org/resource/concept/147509
definition: внутренняя энергия, способность концентрироваться и совершать духовные движения
in scheme: ruthes
lexicalized sense: 135446-жизненная сила-ng-0
lexicalized sense: 135446-сила-n-0