УСКОРЕНИЕ (ФИЗИЧЕСКАЯ ВЕЛИЧИНА)
type: LexicalConcept
association1: http://lod.ruthes.org/resource/concept/110034
association2: http://lod.ruthes.org/resource/concept/124198
holonym: http://lod.ruthes.org/resource/concept/128664
hypernym: http://lod.ruthes.org/resource/concept/110871
definition: скорость изменения пространственной скорости
in scheme: ruthes
lexicalized sense: 135473-ускорение-n-0