ЭКСЦЕНТРИЧНЫЙ (ВЫЗЫВАЮЩИЙ)
type: LexicalConcept
association: http://lod.ruthes.org/resource/concept/123854
hypernym: http://lod.ruthes.org/resource/concept/118146
hypernym: http://lod.ruthes.org/resource/concept/119359
hyponym: http://lod.ruthes.org/resource/concept/123835
definition: склонность к странному, необычному поведению; эксцентричный нрав, характер
in scheme: ruthes
lexicalized sense: 135692-эксцентрический-adj-0
lexicalized sense: 135692-эксцентричность-n-0
lexicalized sense: 135692-эксцентричный-adj-0