ФОБИЯ, НАВЯЗЧИВЫЙ СТРАХ
type: LexicalConcept
hypernym: http://lod.ruthes.org/resource/concept/106792
hypernym: http://lod.ruthes.org/resource/concept/3949
hyponym: http://lod.ruthes.org/resource/concept/126567
hyponym: http://lod.ruthes.org/resource/concept/136973
hyponym: http://lod.ruthes.org/resource/concept/140261
definition: устойчивые патологические проявления различных страхов
in scheme: ruthes
lexicalized sense: 135768-навязчивый страх-ng-0
lexicalized sense: 135768-фобия-n-0