НЕРИТМИЧНЫЙ, АРИТМИЧНЫЙ
type: LexicalConcept
association: http://lod.ruthes.org/resource/concept/120664
association2: http://lod.ruthes.org/resource/concept/125067
hypernym: http://lod.ruthes.org/resource/concept/139619
hypernym: http://lod.ruthes.org/resource/concept/150752
definition: характеризующийся отсутствием или нарушением ритма
in scheme: ruthes
lexicalized sense: 135847-аритмический-adj-0
lexicalized sense: 135847-аритмичность-n-0
lexicalized sense: 135847-аритмичный-adj-0
lexicalized sense: 135847-неритмичность-n-0
lexicalized sense: 135847-неритмичный-adj-0