НЕВОСПИТАННЫЙ
type: LexicalConcept
association: http://lod.ruthes.org/resource/concept/125218
association1: http://lod.ruthes.org/resource/concept/139088
hypernym: http://lod.ruthes.org/resource/concept/106924
hyponym: http://lod.ruthes.org/resource/concept/127126
definition: неумение вести себя в обществе подобающим образом
in scheme: ruthes
lexicalized sense: 136267-дурно воспитанный-adjg-0
lexicalized sense: 136267-невоспитанность-n-0
lexicalized sense: 136267-невоспитанный-adj-0
lexicalized sense: 136267-плохо воспитанный-adjg-0