ЭВТАНАЗИЯ
type: LexicalConcept
association1: http://lod.ruthes.org/resource/concept/1045
association1: http://lod.ruthes.org/resource/concept/1061
association1: http://lod.ruthes.org/resource/concept/137388
hypernym: http://lod.ruthes.org/resource/concept/1062
hypernym: http://lod.ruthes.org/resource/concept/111386
hypernym: http://lod.ruthes.org/resource/concept/4628
definition: намеренное ускорение смерти или умерщвление неизлечимого больного с целью прекращения его страданий
in scheme: ruthes
lexicalized sense: 136951-эвтаназировать-v-0
lexicalized sense: 136951-эвтаназия-n-0