СОГЛАСОВАНИЕ СЛОВ
type: LexicalConcept
association1: http://lod.ruthes.org/resource/concept/114299
hypernym: http://lod.ruthes.org/resource/concept/137259
definition: вид подчинительной связи, при котором зависимое слово уподобляется в выражении грамматических значений господствующему слову
in scheme: ruthes
lexicalized sense: 137258-согласование-n-0
lexicalized sense: 137258-согласование слов-ng-0
lexicalized sense: 137258-согласованность-n-0
lexicalized sense: 137258-согласовать-v-0
lexicalized sense: 137258-согласовать слова-vg-0
lexicalized sense: 137258-согласоваться-v-0
lexicalized sense: 137258-согласовывать-v-0
lexicalized sense: 137258-согласовываться-v-0