МОТИВ ПРОИЗВЕДЕНИЯ
type: LexicalConcept
holonym: http://lod.ruthes.org/resource/concept/107666
hypernym: http://lod.ruthes.org/resource/concept/106821
definition: простейшая единица сюжета; тема, сюжет произведения искусства
in scheme: ruthes
lexicalized sense: 137271-мотив-n-0
lexicalized sense: 137271-мотив произведения-ng-0