НАСТРОЕНИЕ СДЕЛАТЬ
type: LexicalConcept
hypernym: http://lod.ruthes.org/resource/concept/106476
hyponym: http://lod.ruthes.org/resource/concept/141725
definition: расположение, склонность, желание делать что-либо
in scheme: ruthes
lexicalized sense: 137432-настроение-n-0
lexicalized sense: 137432-настроение делать-vg-0
lexicalized sense: 137432-настроение сделать-vg-0