ДОЖДЬ, МНОЖЕСТВО ПАДАЮЩЕГО
type: LexicalConcept
hypernym: http://lod.ruthes.org/resource/concept/107160
hypernym: http://lod.ruthes.org/resource/concept/109230
definition: потоки чего-либо, падающего во множестве
in scheme: ruthes
lexicalized sense: 137449-дождь-n-0
lexicalized sense: 137449-ливень-n-0
lexicalized sense: 137449-множество падающего-ng-0
lexicalized sense: 137449-ураган-n-0