ДОСТОПРИМЕЧАТЕЛЬНОСТЬ
type: LexicalConcept
holonym: http://lod.ruthes.org/resource/concept/1633
hypernym: http://lod.ruthes.org/resource/concept/106451
definition: место, здание, предмет, достойные особого внимания, замечательные чем-либо
in scheme: ruthes
lexicalized sense: 137467-достопримечательное место-ng-0
lexicalized sense: 137467-достопримечательность-n-0
lexicalized sense: 137467-место паломничества туристов-ng-0