МОНАРХИЧЕСКАЯ ДИНАСТИЯ
type: LexicalConcept
association1: http://lod.ruthes.org/resource/concept/110193
hypernym: http://lod.ruthes.org/resource/concept/145026
definition: в монархических государствах — ряд монархов из одного и того же рода (семьи), сменяющих друг друга на престоле по праву наследования
in scheme: ruthes
lexicalized sense: 137588-династийный-adj-0
lexicalized sense: 137588-династический-n-0
lexicalized sense: 137588-династия-n-0
lexicalized sense: 137588-королевская династия-ng-0
lexicalized sense: 137588-монархическая династия-ng-0