РЕЗКИЙ (ВНЕЗАПНЫЙ И ОЧЕНЬ ЗНАЧИТЕЛЬНЫЙ)
type: LexicalConcept
association1: http://lod.ruthes.org/resource/concept/106629
hypernym: http://lod.ruthes.org/resource/concept/114608
hypernym: http://lod.ruthes.org/resource/concept/119310
definition: действующий и проявляющийся с большой силой, остротой, пронизывающий
in scheme: ruthes
lexicalized sense: 137677-пронзительность-n-0
lexicalized sense: 137677-пронзительный-adj-0
lexicalized sense: 137677-резкий-adj-0
lexicalized sense: 137677-резковатый-adj-0
lexicalized sense: 137677-резкость-n-0