РЕДКИЙ, РЕДКО СЛУЧАЮЩИЙСЯ
type: LexicalConcept
association: http://lod.ruthes.org/resource/concept/123428
hypernym: http://lod.ruthes.org/resource/concept/119581
hyponym: http://lod.ruthes.org/resource/concept/118141
definition: не отличающийся частотой, происходящий редко
in scheme: ruthes
lexicalized sense: 137698-малочисленность-n-0
lexicalized sense: 137698-малочисленный-adj-0
lexicalized sense: 137698-нечастый-adj-0
lexicalized sense: 137698-редкий-adj-0
lexicalized sense: 137698-редкость-n-0