УГЛОВАЯ СЕКУНДА
type: LexicalConcept
hypernym: http://lod.ruthes.org/resource/concept/129654
definition: единица измерения углов, 1/3600-я часть градуса
in scheme: ruthes
lexicalized sense: 137719-секунда-n-0
lexicalized sense: 137719-угловая секунда-ng-0