СТИМУЛИРУЮЩЕЕ ВЕЩЕСТВО
type: LexicalConcept
holonym: http://lod.ruthes.org/resource/concept/135194
hypernym: http://lod.ruthes.org/resource/concept/1067
hypernym: http://lod.ruthes.org/resource/concept/820
hyponym: http://lod.ruthes.org/resource/concept/126089
hyponym: http://lod.ruthes.org/resource/concept/140373
hyponym: http://lod.ruthes.org/resource/concept/9050
hyponym: http://lod.ruthes.org/resource/concept/9596
definition: вещество, стимулирующее развитие чего-либо
in scheme: ruthes
lexicalized sense: 138379-стимулирующее вещество-ng-0
lexicalized sense: 138379-стимулирующее средство-ng-0
lexicalized sense: 138379-стимулирующий препарат-ng-0
lexicalized sense: 138379-стимулятор-n-0