ЛЕГИОН (ВООРУЖЕННОЕ ФОРМИРОВАНИЕ)
type: LexicalConcept
hypernym: http://lod.ruthes.org/resource/concept/124282
hyponym: http://lod.ruthes.org/resource/concept/146724
meronym: http://lod.ruthes.org/resource/concept/147532
definition: особое воинское подразделение в некоторых странах
in scheme: ruthes
lexicalized sense: 138488-легион-n-0