ДОМ-МУЗЕЙ
type: LexicalConcept
association1: http://lod.ruthes.org/resource/concept/129730
association1: http://lod.ruthes.org/resource/concept/131682
hypernym: http://lod.ruthes.org/resource/concept/7592
hyponym: http://lod.ruthes.org/resource/concept/143821
definition: квартира писателя, художника и т. п., сохраненная после его смерти для обозрения
in scheme: ruthes
lexicalized sense: 138554-дом-музей-n-0
lexicalized sense: 138554-дом-усадьба-n-0
lexicalized sense: 138554-музей-квартира-n-0
lexicalized sense: 138554-музей-усадьба-n-0