ПЕРЕЛОМ КОСТИ
type: LexicalConcept
association1: http://lod.ruthes.org/resource/concept/109221
association2: http://lod.ruthes.org/resource/concept/146536
hypernym: http://lod.ruthes.org/resource/concept/106500
hypernym: http://lod.ruthes.org/resource/concept/131727
hypernym: http://lod.ruthes.org/resource/concept/2059
hyponym: http://lod.ruthes.org/resource/concept/138943
hyponym: http://lod.ruthes.org/resource/concept/138944
definition: нарушение целостности кости человека или животного
in scheme: ruthes
lexicalized sense: 138942-костный перелом-ng-0
lexicalized sense: 138942-перелом-n-0
lexicalized sense: 138942-перелом кости-ng-0