КАМИКАДЗЕ
type: LexicalConcept
hypernym: http://lod.ruthes.org/resource/concept/114456
hypernym: http://lod.ruthes.org/resource/concept/127439
hypernym: http://lod.ruthes.org/resource/concept/216
definition: во время второй мировой войны в японской армии: лётчик-смертник, погибавший вместе с атакующим цель самолётом
in scheme: ruthes
lexicalized sense: 139139-камикадзе-n-0