ХАРИЗМА
type: LexicalConcept
association1: http://lod.ruthes.org/resource/concept/117098
hypernym: http://lod.ruthes.org/resource/concept/106924
hypernym: http://lod.ruthes.org/resource/concept/106943
hypernym: http://lod.ruthes.org/resource/concept/135446
definition: эмоционально-психические способности человека, благодаря которым его оценивают как одарённого особыми качествами и способного оказывать эффективное влияние на людей
in scheme: ruthes
lexicalized sense: 139171-харизма-n-0
lexicalized sense: 139171-харизматический-adj-0