НЕПОСЛУШНЫЙ (ЧЕРТА ХАРАКТЕРА)
type: LexicalConcept
association: http://lod.ruthes.org/resource/concept/118964
hypernym: http://lod.ruthes.org/resource/concept/106924
hyponym: http://lod.ruthes.org/resource/concept/119476
hyponym: http://lod.ruthes.org/resource/concept/128590
definition: не признающий над собою чьей-либо власти; строптивый
in scheme: ruthes
lexicalized sense: 140166-непокорность-n-0
lexicalized sense: 140166-непокорный-adj-0
lexicalized sense: 140166-непокорство-n-0
lexicalized sense: 140166-непослушный-adj-0